N1 has copy
type: ObjectProperty
sub property of: P130i features are also found on
inverse of: N1i is copy of
domain: K5 Source Content
range: K5 Source Content
comment: Diese Eigenschaft beschreibt den Zusammenhang der inhaltlichen Kopie zwischen zwei Instanzen der Klasse K5 Source Content, z.B. Inventar 1670 ist eine Kopie von Inventar 1665.
comment: This property describes the relationship of the content copy between two instances of the class K5 Source Content, e.g. inventory 1670 is a copy of inventory 1665. @en

R3 modified content
type: ObjectProperty
sub property of: P94 has created
inverse of: R3i content was modified by
domain: K67 Source Content Modification
range: E28 Conceptual Object
comment: Diese Eigenschaft beschreibt die inhaltliche Veränderung von Instanzen der Klasse E28 Conceptual Object innerhalb eines Ereignisses der Klasse K67 Source Content Modification.
comment: This property describes the content modification of instances of the class E28 Conceptual Object within an event of the class K67 Source Content Modification.

P82a has earliest start
type: DatatypeProperty
domain: E52 Time-Span
comment: Diese Eigenschaft beschreibt die frühestmögliche Startzeit einer Instanz von E52_Time-Span.
comment: This property decribes the earliest possible start time of an instance of E52_Time-Span. @en

P82b has latest end
type: DatatypeProperty
domain: E52 Time-Span
comment: Diese Eigenschaft beschreibt die spätestmögliche Endzeit einer Instanz von E52_Time-Span.
comment: This property decribes the latest possible end time of an instance of E52_Time-Span. @en

K10 Transcription
type: Class
subclass of: E31 Document
comment: Diese Klasse dient der Erfassung von Transkriptionen von Instanzen der Klasse K5 Source Content.
comment: This class is used to capture transcriptions of instances of the K5 Source Content class. @en

K11 Inventory Number
type: Class
subclass of: E42 Identifier
comment: Diese Klasse umfasst Zeichenketten oder Kodierungen, die Instanzen der Klasse K1 Object zugewiesen werden, um sie eindeutig und dauerhaft innerhalb des Sammlungskontexts zu identifizieren. Beispiele: - 7.5.16/102 - I1053
comment: This class contains strings or encodings that are assigned to instances of class K1 Object to identify them uniquely and permanently within the collection context. Examples: - 7.5.16/102 - I1053 @en

K12 Identifier
type: Class
subclass of: E42 Identifier
comment: Diese Klasse umfasst sprechende Identifikatoren, die Instanzen der Klasse K1 Object zugewiesen werden, um sie eindeutig und dauerhaft innerhalb des Sammlungskontexts zu identifizieren. Anders als bei K11 Inventory Number handelt es sich hier um Behelfsnamen, die ein historisches Objekt in einer historischen Sammlung eindeutig bezeichnen. Beispiele: - Eingefasster Ring mit Perlmuttschale - Präparat eines großen Krokodils ohne Vorderfüße
comment: This class includes speaking identifiers assigned to instances of the K1 Object class to uniquely and permanently identify them within the collection context. Unlike K11 Inventory Number, these are makeshift names that uniquely identify a historical object in a historical collection. Examples: - Set ring with mother of pearl shell - Preparation of a large crocodile without forefeet @en

K14 Source Type
type: Class
subclass of: E55 Type
comment: Diese Klasse umfasst die Arten von Quellen bzw. ihrer Inhalte K5 Source Content, die aus der Funktion der Quelle bzw. der Intention, aus der sie angelegt wurden, abgeleitet sind, z.B. - Inventar - Verzeichnis - Katalog - Reisejournal - Museumsführer - Fotografie
comment: This class includes the types of sources or their contents K5 Source Content derived from the function of the source or the intention from which they were created, e.g. - Inventory - Directory - Catalogue - Travel Journal - Museum guide - Photograph @en

K15 Literature
type: Class
subclass of: E31 Document
comment: Instances of this class describe physical and electronic secondary literature, that is written in a natural language, e.g. - The publication "Le peintre graveur" by Adam von Bartsch. - a digital representation of a publication
comment: Instanzen dieser Klasse beschreiben physische und elektronische Sekundärliteratur, die in einer natürlichen Sprache verfasst sind, z.B. - Die Publikation "Le peintre graveur" von Adam von Bartsch. - ein Digitalisat einer Publikation @en

K16 Literature Section
type: Class
subclass of: E31 Document
comment: Diese Klasse umfasst Abschnitte von Instanzen der Klasse K15 Literature, z.B. - Seite 8 von Bartsch, 1808 - Kapitel 1
comment: This class comprises sections of Instances of K15 Literature, e.g. - Page 8 of Bartsch, 1808 - Chapter 1 @en

K17 Object Attribution
type: Class
subclass of: E13 Attribute Assignment
comment: Diese Klasse dient dazu, über Instanzen der Klasse K1 Object getätigte Aussagen oder ihnen zugewiesene Eigenschaften aus Instanzen der Klasse K5 Source Content zu dokumentieren. Beispiel: Zuweisung der Bezeichnung/Beschreibung "Ain grosser Krokodil. Mangeln die beiden Vorderen Füsse" für K1 Präparat eines großen Krokodils ohne Vorderfüße in Quelle Anonymus B.
comment: This class comprises the actions of making assertions about properties of instances of K1 Object that are documented in instances of K5 Source Content. Example: Assignment of the Appellation/Description "Ain grosser Krokodil. Mangeln die beiden Vorderen Füsse" to K1 Object Preparation of a large crocodile without front feet in K5 Source Content Anonymus B. @en

K18 Collection Attribution
type: Class
subclass of: E13 Attribute Assignment
comment: Diese Klasse dient dazu, über Instanzen der Klasse K2 Collection getätigte Aussagen oder ihnen zugewiesene Eigenschaften zu dokumentieren, die aus Instanzen der Klasse K5 Source Content stammen. Beispiel: Zuweisung der Lokalisierung der Sammlung K2 Kunstkammer im Standort 3. OG, Berliner Schloss in Quelle Anonymus B.
comment: This class is used to document statements made about or properties assigned to instances of the K2 Collection class that originate from instances of K5 Source Content. Example: Assignment of the location of the K2 Collection Kunstkammer in the 3rd floor location, Berlin Palace in K5 Source Content Anonymus B. @en

K1 Object
type: Class
subclass of: E22 Man-Made Object
comment: Diese Klasse umfasst konkrete Gegenstände, die von menschlicher Aktivität bewusst zum Bestand einer Sammlung hinzugefügt wurden und von Instanzen der Klasse E39 kuratorisch betreut werden. Instanzen der Klasse K1 müssen nicht notwendigerweise noch existieren, z.B. - das Objekt Eingefasster Ring mit Perlmuttschale aus der Berliner Kunstkammer - das Objekt Präparat eines großen Krokodils ohne Vorderfüße aus der Berliner Kunstkammer - der Diana-Automat im Kunstgewerbemuseum Berlin, K 3899
comment: This class includes concrete objects that have been intentionally added by human activity to the inventory of a collection and curated by one or more instances of E39_Actor over time. Instances of the class K1 do not necessarily still exist, e. g. - the object Set ring with mother-of-pearl shell from Berlin Kunstkammer - the object Preparation of a large crocodile without front feet from the Berlin Kunstkammer - the Diana automaton in the Berlin Museum of Decorative Arts, K 3899 @en

K20 Appellation Attribution
type: Class
subclass of: E13 Attribute Assignment
comment: Diese Klasse dient dazu, über Instanzen der Klasse K1 Object getätigte Aussagen oder ihnen zugewiesene Eigenschaften bezüglich der Art ihrer Bezeichnung E41 Appellation aus Instanzen der Klasse K5 Source Content zu dokumentieren. K20 Appellation Attribution geschieht im Kontext von K17 Object Attribution. Beispiel: Ereignis der Zuweisung der Bezeichnung "Ain grosser Krokodil. Mangeln die beiden Vorderen Füsse" für K1 Object Präparat eines großen Krokodils ohne Vorderfüße in Quelle Anonymus B.
comment: This class is used to document statements made about instances of the class K1 Object or properties assigned to them regarding the nature of their E41 Appellation from instances of the class K5 Source Content. K20 Appellation Attribution happens in the context of K17 Object Attribution. Example: Event of the attribution of the designation "Ain big crocodile. Lack the two front feet" for K1 Object specimen of a large crocodile without front feet in source Anonymus B. @en

K23 Collection Systematic Attribution
type: Class
subclass of: E13 Attribute Assignment
comment: Diese Klasse dient dazu, über Instanzen der Klasse K1 Object getätigte Aussagen über die Zuweisung zu einer Sammlungssystematik K37 in Instanzen der Klasse K5 Source Content zu dokumentieren. K25 Collection Systematic Attribution geschieht im Kontext von K17 Object Attribution. Beispiel: Ereignis der Zuweisung der Sammlungssystematik "Naturalia" für K1 Object Präparat eines großen Krokodils ohne Vorderfüße in Quelle Anonymus B.
comment: This class is used to document assertions made about instances of the class K1 Object about the assignment to a collection systematics K37 in instances of the class K5 Source Content. K25 Collection Systematic Attribution happens in the context of K17 Object Attribution. Example: Event of the assignment of the collection systematics "Naturalia" for K1 Object specimen of a large crocodile without front feet in source Anonymus B. @en

K24 Location Attribution
type: Class
subclass of: E13 Attribute Assignment
comment: Diese Klasse dient dazu, über Instanzen der Klasse K1 Object getätigte Aussagen über ihre K9 Lokalisierung im Sammlungsraum in Instanzen der Klasse K5 Source Content zu dokumentieren. K24 Location Attribution geschieht im Kontext von K17 Object Attribution. Beispiel: Ereignis der Zuweisung der Lokalisierung "im Dritten Gemach links der Tür" für K1 Object Präparat eines großen Krokodils ohne Vorderfüße in Quelle Anonymus B.
comment: This class is used to document statements made about instances of the class K1 Object about their K9 location in the collection space in instances of the class K5 Source Content. K24 Location Attribution happens in the context of K17 Object Attribution. Example: Event of attribution of localization "in the Third Chamber to the left of the door" for K1 Object preparation of a large crocodile without front feet in Source Anonymous B. @en

K25 Geo-Coordinates
type: Class
subclass of: E47 Spatial Coordinates
comment: Diese Klasse umfasst die numerische Information, mit der eine bestimmte Instanz der Klasse E53_Place innerhalb räumlicher Schemata lokalisiert werden kann. Eine Instanz der Klasse K25_Geo-Coordinates beschreibt die Lage eines Punktes auf der Erde in Form von Kugelkoordinaten bzw. GPS-Koordinaten. Beispiel: Die Stadt Nürnberg hat die Koordinaten 49° 27′ N , 11° 5′ O.
comment: This class contains the numeric information with which a particular instance of the class E53_Place can be located within spatial schemata. An instance of class K25_Geo-Coordinates describes the position of a point on earth in the form of spherical coordinates or GPS coordinates. Example: The city of Nuremberg has the coordinates 49° 27' N, 11° 5' O. @en

K26 Foundation
type: Class
subclass of: E63 Beginning of Existence
comment: Diese Klasse umfasst Ereignisse, bei denen Instanzen der Klasse K2 Collection gegründet bzw. ins Leben gerufen werden. Beispiel: - Die Gründung der Kunst- und Wunderkammer auf Schloss Ambras in Innsbruck. - Die Neugründung der Brandenburgisch-Preußischen Kunstkammer nach dem Dreißigjährigen Krieg durch Kurfürst Friedrich Wilhelm.
comment: This class includes events that bring into existence instances of the K2 Collection class. Example: - The founding of the Kunst- und Wunderkammer at Ambras Castle in Innsbruck. - The re-foundation of the Brandenburg-Prussian Kunstkammer after the Thirty Years' War by Elector Friedrich Wilhelm. @en

K2 Collection
type: Class
subclass of: E78 Curated Holding
comment: Diese Klasse umfasst kuratierte Aggregationen von Instanzen der Klasse K1 Object, z.B. - Die Sammlung der Brandenburgisch-Preußischen Kunstkammer - Die Sammlung Linck
comment: This class comprises curated aggregations of instances of K1 Object, e.g. - The Collection of the Brandenburg-Prussian Kunstkammer - The Linck Collection @en

K32 URL
type: Class
subclass of: E51 Contact Point
comment: Diese Klasse umfasst die Identifikationsbezeichnung URL (Uniform Resource Locator), um eine Ressource im Computernetzwerk zu identifizieren und zu lokalisieren.
comment: This class comprises the identifiers URL (Uniform Resource Locator) to identify and locate a resource on the computer network. @en

K33 Alternative Title
type: Class
subclass of: E35 Title
comment: Instances of this class include alternative names for instances of the class K1 Object, K4 Source, or K5 Source Content.
comment: Instanzen dieser Klasse umfassen alternative Bezeichnungen für Instanzen der Klasse K1 Object, K4 Source oder K5 Source Content. @en

K34 Content Keyword
type: Class
subclass of: E55 Type
comment: Diese Klasse umfasst Schlüsselwörter und Tags, die zur Klassifizierung verwendet werden. Sie sind weniger strukturiert als Begriffe aus kuratierten Thesauri oder Klassifikationssystemen. Sie können völlig unstrukturiert sein und sich on-the-fly zusammensetzen, z.B. durch Crowd Sourcing. Beispiel: "Malen" als Tag mit loser / unklarer Semantik im Gegensatz zum gut definierten Begriff "Bilder" von Getty AAT (300033618).
comment: This class comprises keywords and tags used for classification. They are less structured than terms coming from curated thesauri or classification systems. They may be completely unstructured and made up on-the-fly, e.g. by crowdsourcing. Example: "Painting" as a tag with loose / unclear semantics as opposed to the well defined term "paintings" from Getty AAT (300033618) @en

K35 Digital Image
type: Class
subclass of: E38 Image
comment: An instance of K35 Digital Image visually represents instances of another class, e.g. K1 Object or K5 Source Content . Classically, these are digital photographs or scans with the file extensions TIFF or PNG. Example: The digital image (K35 Digital Image) represents the collection object "Hercules statuette from ivory" (K1 Object) and can be found at URL XY (K32 URL).
comment: Eine Instanz von K35 Digital Image repräsentiert visuell Instanzen, z.B. der Klasse K1 Object oder K5 Source Content. Klassischerweise handelt es sich dabei um digitale Fotografien oder Scans mit den Dateiendungen TIFF oder PNG. Beispiel: Die digitale Aufnahme (K35 Digital Image) stellt das Sammlungsobjekt "Herkulesstatuette aus Elfenbein" (K1 Object) dar und ist unter der URL XY (K32 URL) zu finden. @en

K36 Description
type: Class
subclass of: E31 Document
comment: Diese Klasse dient der Beschreibung von Instanzen der Klasse E22 Man Made Object.
comment: This class is used for the description of instances of the class E22 Man Made Object. @en

K37 Collection Systematics
type: Class
subclass of: E55 Type
comment: Diese Klasse umfasst Begriffe, die die Systematik einer Sammlung beschreiben. Diese können bei historischen Sammlungen z. B. aus Inventaren oder Sammlungsbeschreibungen abgeleitet werden. Auch umfasst diese Klasse Systematiken, die in gegenwärtigen Sammlungen vorzufinden sind. z.B. - Geschnitzte und gedrechselte Kunstsachen - Naturalien - Europäisches Kunsthandwerk des 19. Jahrhunderts
comment: This class includes terms that describe the systematics of a collection. For historical collections, these can be derived from inventories or collection descriptions, for example. Also, this class includes systematics found in contemporary collections. E.g. - Carved and turned art objects - Naturalia - European arts and crafts of the 19th century @en

K38 Presentation Attribution
type: Class
subclass of: E13 Attribute Assignment
comment: Diese Klasse dient dazu, über Instanzen der Klasse K1 Object getätigte Aussagen oder ihnen zugewiesene Eigenschaften bezüglich der Art ihrer Präsentation im Sammlungsraum (K39 Type of Presentation) aus Instanzen der Klasse K5 Source Content zu dokumentieren. K38 Presentation Attribution geschieht im Kontext von K17 Object Attribution. Beispiel: Ereignis der Zuweisung der Präsentationsart K39 "von der Decke hängend" für K1 Object Präparat eines großen Krokodils ohne Vorderfüße in Quelle Anonymus B.
comment: This class is used to document statements made about instances of the class K1 Object or properties assigned to them regarding the type of their presentation in the collection space (K39 Type of Presentation) from instances of the class K5 Source Content. K38 Presentation Attribution happens in the context of K17 Object Attribution. Example: event of assigning presentation type K39 "hanging from the ceiling" for K1 Object Preparation of a large crocodile without front feet in source Anonymus B. @en

K39 Type of Presentation
type: Class
subclass of: E55 Type
comment: Diese Klasse umfasst Begriffe, die die Art der Präsentation eines Objekts beschreiben, und die im Kontext von K38 Presentation Assignment zugewiesen werden, z.B. - auf einem Sockel - an der Wand - im Schrank
comment: This class includes terms describing the way an object is presented, assigned in the context of K38 Presentation Assignment, e.g. - on a pedestal - on the wall - in a cabinet @en

K41 Occupation
type: Class
subclass of: E55 Type
comment: Diese Klasse umfasst die Arten von Berufen oder Geschäftsbetrieben von Instanzen der Klasse E21 Person, z.B. "Goldschmied", "Künstler", ...
comment: This class comprises comprises the types of work or business of instances of E21 Person, e.g. "Goldsmith", "Artist", ... @en

K42 Source Content Section
type: Class
subclass of: E73 Information Object
comment: Diese Klasse umfasst Abschnitte von Instanzen der Klasse K5 Source Content, z.B. - "Zwey Waßer Saphyr Körner" aus Eingangsbuch 1688/1692b, fol. 4v - "Ein Baum, worinnen ein Hirsch-Geweih stecket, welches in Preußisch Litthauen in einem Walde gefunden worden, davon man aber nicht eigentlich urtheilen kan, wie es dahin gekommen." aus Küster 1756, S. 20
comment: This class comprises sections of Instances of K5 Source Content, e.g. - "Zwey Waßer Saphyr Körner" aus Eingangsbuch 1688/1692b, fol. 4v - "Ein Baum, worinnen ein Hirsch-Geweih stecket, welches in Preußisch Litthauen in einem Walde gefunden worden, davon man aber nicht eigentlich urtheilen kan, wie es dahin gekommen." aus Küster 1756, S. 20 @en

K43 Editing
type: Class
subclass of: E13 Attribute Assignment
comment: Die Klasse umfasst die Aktionen der Erstellung und Bearbeitung eines Datensatzes. Beispiel: Eingabe eines Objektdatensatzes in die Datenbank durch Mitarbeiter*in XY.
comment: The class includes the actions of creating and editing a data record. Example: Entering an object data record in the collection database by employee XY. @en

K44 Editor
type: Class
subclass of: E21 Person
comment: Diese Klasse bezieht sich auf Akteure im Kontext von Aktionen der Erstellung und Bearbeitung eines Datensatzes, die unter K43 Editing zusammengefasst sind.
comment: This class refers to actors in the context of actions of creating and editing a dataset, which are comprised under K43 Editing. @en

K45 Editing Status
type: Class
subclass of: E55 Type
comment: Diese Klasse umfasst Arten von Zuständen des Prozesses der Bearbeitung (K43_Editing) eines Datensatzes, z.B. - abgeschlossen - in Bearbeitung
comment: This class comprises types of states of the process of K43_Editing a dataset, e.g. - finished - in progress @en

K46 Objecttype Assignment
type: Class
subclass of: E17 Type Assignment
comment: Diese Klasse dokumentiert die Zuweisung von Ereignissen, bei denen Instanzen der Klasse K1 Object ein K7 Object Type zugewiesen wird, z. B. Das Ereignis der Zuweisung der Objektart K37 "Präparat, tierisch" für K1 Object "Ain grosser Krokodil. Mangeln die beiden Vorderen Füsse" für K1 Präparat eines großen Krokodils ohne Vorderfüße.
comment: This class documents the assignment of events where instances of the K1 Object class are assigned a K7 Object Type, e.g. The event of assignment of object type K37 "Preparation, animal" for K1 Object "Ain big crocodile. Lack the two front feet" for K1 Preparation of a large crocodile without front feet. @en

K47 Mediation Attribution
type: Class
subclass of: E13 Attribute Assignment
comment: Diese Klasse dient dazu, über Instanzen der Klasse K1 Object getätigte Aussagen über ihre Vermittlung durch Akteure in Instanzen der Klasse K5 Source Content zu dokumentieren. K47 Mediation Attribution geschieht im Kontext von K17 Object Attribution. Beispiel: - Ereignis der Zuweisung von Angaben zur Vermittlung von K1 Object Präparat eines großen Krokodils ohne Vorderfüße in Quelle Anonymus B. In der Quelle wird beschrieben, dass das Objekt durch Besuchende der Sammlung beim Rundgang angefasst werden durfte. - In der Quelle Silbermann 1741, die einen Besuch der Kunstkammer durch den Orgelbauer Johann Andreas Silbermann dokumentiert, ist die Anekdote überliefert, dass das Objekt K1 Lebensgroße Wachsbossierung König Friedrichs I. so lebensecht aussah, dass ein Kammerdiener die Figur für echt hielt und sich im Glauben, dass der König tot sei derart erschrak, dass er kurz darauf verstarb. Diese Anekdote wurden dem Gast beim Besuch der Kunstkammer erzählt, der sie in seinem Reisebericht festhielt.
comment: This class is used to document statements made about instances of the class K1 Object about their mediation by actors in instances of the class K5 Source Content. K47 Mediation Attribution occurs in the context of K17 Object Attribution. Example: - Event of attribution of statements about mediation of K1 Object specimen of a large crocodile without front feet in source Anonymus B. In the source it is described that the object was allowed to be touched by visitors of the collection during the tour. - In the source Silbermann 1741, which documents a visit to the Kunstkammer by the organ builder Johann Andreas Silbermann, the anecdote is passed down that the object K1 Life-size wax bossing of King Frederick I looked so lifelike that a valet thought the figure was real and, believing that the king was dead, was so frightened that he died shortly afterwards. This anecdote was told to the guest visiting the Kunstkammer, who recorded it in his travelogue. @en

K4 Source
type: Class
subclass of: E22 Man-Made Object
comment: Diese Klasse umfasst physische Gegenstände, die z.B. Instanzen der Klasse K1 Object oder K2 Collection dokumentieren und die oft selbst Teil einer K2 Sammlung sind und kuratorisch betreut werden, insbesondere Archivalien wie Inventare oder Reisejournale, historische Literatur wie gedruckte Sammlungsführer oder auch fotografisches Material, z.B. - das Inventar der Brandenburgisch-Preußischen Kunstkammer aus dem Jahr 1605, das im Geheimen Staatsarchiv Preußischer Kulturbesitz unter der Signatur GStA PK, I. HA, Rep. 9, Allgemeine Verwaltung, Nr. D 2, Fasz. 1, fol. 13r-43r verwahrt wird. - die anonym verfasste Beschreibung der Brandenburgisch-Preußischen Kunstkammer "Anonymus B" aus dem Jahr 1740. - die Fotografie von Gustav Schwarz, die eine Raumansicht der rekonstruierten Brandenburgisch-Preußischen Kunstkammer auf der Berliner Sommerschau 1930 in den Funkturmhallen zeigt. - der gedruckte Stadtführer von Friedrich Nicolai von 1769, der eine Beschreibung der Sammlung der Brandenburgisch-Preußischen Kunstkammer enthält.
comment: This class includes physical objects that document, for example, instances of the K1 Object or K2 Collection and that are often themselves part of a K2 Collection and curated, especially archival materials such as inventories or travel journals, historical literature such as printed collection guides, or photographic materials, e.g. - the inventory of the Brandenburg-Prussian Kunstkammer from 1605, which is kept in the Geheimes Staatsarchiv Preußischer Kulturbesitz under the signature GStA PK, I. HA, Rep. 9, Allgemeine Verwaltung, No. D 2, Fasz. 1, fol. 13r-43r. - the anonymously written description of the Brandenburg-Prussian Kunstkammer "Anonymus B" from 1740. - the photograph by Gustav Schwarz showing a room view of the reconstructed Brandenburg-Prussian Kunstkammer at the 1930 Berlin Summer Show in the Funkturmhallen. - the printed city guide by Friedrich Nicolai from 1769, which contains a description of the collection of the Brandenburg-Prussian Kunstkammer. @en

K52 Mediation Type
type: Class
subclass of: E55 Type
comment: Diese Klasse umfasst Begriffe, die die Art der Vermittlung von Instanzen der Klasse K1 Object während eines Rundgangs durch die Sammlung oder innerhalb eines Textes beschreiben, und die im Kontext einer K47 Mediation Attribution zugewiesen werden, z.B. - Erläuterung zum Objekt - Anekdote
comment: This class includes terms that describe how instances of the K1 Object class are mediated during a tour of the collection or within a text, and are assigned in the context of a K47 Mediation Attribution, e.g. - Explanation of the object - Anecdote @en

K53 Location Type
type: Class
subclass of: E55 Type
comment: Diese Klasse umfasst Begriffe, die Arten von Standorten beschreiben, z.B. - ein Raum - ein Standort im Raum - ein Standort innerhalb eines Sammlungsmöbels
comment: This class includes terms that describe types of locations, e.g. - a room - a location within a room - a location within a collection furniture @en

K54 GND-Identifier
type: Class
subclass of: E42 Identifier
comment: Diese Klasse umfasst Zeichenketten oder Kodierungen, die Instanzen der Klasse E21 Person, E40 Legal Body oder K8 Geographical Place aus der Gemeinsamen Normdatei (GND) der Deutschen Nationalbibliothek zugewiesen werden, um sie eindeutig und dauerhaft zu identifizieren.
comment: This class includes strings or encodings assigned to instances of the class E21 Person, E40 Legal Body, or K8 Geographical Place from the Gemeinsame Normdatei (GND) of the German National Library to uniquely and permanently identify them. @en

K55 Literature Type
type: Class
subclass of: E55 Type
comment: Instances of this class describe the types of literature of class K15 Literature, e.g. monograph, article or product catalogue. @en
comment: Instanzen dieser Klasse beschreiben die Arten von Literatur der Klasse K15 Literature, z.B. Monographie, Artikel oder Produktkatalog.

K56 Guidance Practice Attribution
type: Class
subclass of: E13 Attribute Assignment
comment: Diese Klasse dient dazu, über Instanzen der Klasse K2 Collection getätigte Aussagen über Praktiken der Führung von Besuchenden zu dokumentieren, die aus Instanzen der Klasse K5 Source Content stammen. K56 Guidance Practice Attribution geschieht im Kontext von K18 Collection Attribution. Beispiel: Ereignis der Zuweisung der Führungspraxis, dass zur Zeit König Friedrich Wilhelms I. Besuchende keine Notizen während der Führung machen durften.
comment: This class is used to document guidance practice statements made about instances of the K2 Collection that originate from instances of the K5 Source Content class. K56 Guidance Practice Attribution happens in the context of K18 Collection Attribution. Example: Guidance practice attribution event that at the time of King Frederick William I, visitors were not allowed to take notes during the tour. @en

K58 Exhibition
type: Class
subclass of: E22 Man-Made Object
comment: Diese Klasse umfasst die kuratierte öffentliche Ausstellungen von Instanzen der Klasse K1 Object, wobei es hier nicht um die zeitliche Dimension im Sinne eines Ereignisses geht, sondern vielmehr um die Konstellation physischer Gegenstände, wie Raum, Ausstellungsmobiliar und Objekte z.B. die Ausstellung der Berliner Kunstkammer 1930 in den Funkturmhallen bestehend aus drei Räumen.
comment: This class comprises the curated public exhibitions of instances of the class K1 Object, whereby the temporal dimension in the sense of an event is not the issue here, but rather the constellation of physical objects, such as space, exhibition furniture and objects e.g. the exhibition of the Berlin Kunstkammer 1930 in the Funkturmhallen consisting of three rooms. @en

K59 Condition Attribution
type: Class
subclass of: E13 Attribute Assignment
comment: Diese Klasse dient dazu, in Instanzen der Klasse K5 Source Content über Instanzen der Klasse K1 Object getätigte Aussagen oder ihnen zugewiesene Eigenschaften zu ihrem Erhaltungszustand zu dokumentieren. Beispiel: - Zuweisung des Zustands "Mangeln die beiden Vorderen Füsse" für K1 Objekt Präparat eines großen Krokodils ohne Vorderfüße in Quelle Anonymus B. - Zuweisung des Zustands "verzaust" für K1 Brasilianisches Stachelschwein in Quelle Inventar 1685/1688.
comment: This class is used to document statements made in instances of the K5 Source Content about instances of the K1 Object class or properties assigned to them about their state of condition. Example: - Assignment of the state "lacking the two front feet" for K1 specimen of a large crocodile without front feet in source Anonymous B. - Assignment of the state "ruffled" for Object K1 Brazilian porcupine in source Inventory 1685/1688. @en

K5 Source Content
type: Class
subclass of: E73 Information Object
comment: Diese Klasse umfasst den immateriellen Inhalt von Instanzen der Klasse K4 Source, z.B. - der Inhalt des Inventars der Brandenburgisch-Preußischen Kunstkammer aus dem Jahr 1605, das im Geheimen Staatsarchiv Preußischer Kulturbesitz unter der Signatur GStA PK, I. HA, Rep. 9, Allgemeine Verwaltung, Nr. D 2, Fasz. 1, fol. 13r-43r verwahrt wird. - der Inhalt der anonym verfassten Beschreibung der Brandenburgisch-Preußischen Kunstkammer "Anonymus B" aus dem Jahr 1740.
comment: This class includes the intangible content of instances of the K4 Source class, e. g. - the content of the inventory of the Brandenburg-Prussian Kunstkammer from 1605, which is kept in the Geheimes Staatsarchiv Preußischer Kulturbesitz under the signature GStA PK, I. HA, Rep. 9, Allgemeine Verwaltung, No. D 2, Fasz. 1, fol. 13r-43r. - the content of the anonymously written description of the Brandenburg-Prussian Kunstkammer "Anonymus B" from 1740. @en

K62 Dimension Attribution
type: Class
subclass of: E13 Attribute Assignment
comment: Diese Klasse dient dazu, über Instanzen der Klasse K1 Object getätigte Aussagen oder ihnen zugewiesene Eigenschaften zu ihrer Größe oder ihres materiellen wie immateriellen Wertes aus Instanzen der Klasse K5 Source Content zu dokumentieren. Beispiel: - Zuweisung der Länge "vier Ellen" für K1 Objekt Große Schlangenhaut in Quelle Anonymus A. - Zuweisung des Gewichts "109 Lb" für K1 Der Große Kurfürst als Heiliger Georg in Quelle Inventar 1685/1688.
comment: This class is used to document statements made about instances of the class K1 Object or properties assigned to them about their size or their tangible as well as intangible value from instances of the class K5 Source Content. Example: - Assignment of length "four cubits" for K1 Object Large snakeskin in Source Anonymous A. - Assignment of weight "109 Lb" for K1 The Great Elector as Saint George in source Inventory 1685/1688. @en

K63 Person Attribution
type: Class
subclass of: E13 Attribute Assignment
comment: Diese Klasse dient dazu, in Instanzen der Klasse K5 Source Content über Instanzen der Klasse K1 Object getätigte Aussagen zu mit ihnen in Beziehung stehenden Personen zu dokumentieren. Dabei kann es sich um Beziehungen wie die Herstellung oder die Erfindung eines Objekts handeln. Auch kann eine Beziehung zwischen Objekt oder Person dadurch bestehen, dass diese auf dem Objekt dargestellt ist oder von diesem verkörpert wird. Beispiel: - Zuweisung des Herstellers Gottfried Leygebe für K1 Objekt Der Große Kurfürst als Heiliger Georg in Quelle Inventar 1685/1688. - Zuweisung Kurfürst Friedrich Wilhelms als dargestellte Person von K1 Objekt Der Große Kurfürst als Heiliger Georg in Quelle Inventar 1685/1688.
comment: This class is used to document statements in instances of the class K5 Source Content made about instances of the class K1 Object about persons related to them. This may involve relationships such as the manufacture or invention of an object. Also, a relationship between object or person may exist by being represented on or embodied by the object. Example: - Assignment of maker Gottfried Leygebe for K1 object The Great Elector as Saint George in source inventory 1685/1688. - Assignment of Elector Frederick William as represented person of K1 object The Great Elector as Saint George in source inventory 1685/1688. @en

K64 Type of Activity
type: Class
subclass of: E55 Type
comment: Diese Klasse umfasst Begriffe, die Arten von Aktivitäten beschreiben, z.B. - die Regentschaft einer Person - eine Verwaltungsperiode der Sammlung durch eine Person - eine Schlacht - eine Ausstellung
comment: This class includes terms that describe types of activities, e.g. - the regency of a person - a period of administration of the collection by a person - a battle - an exhibition @en

K65 Person Attribution Type
type: Class
subclass of: E55 Type
comment: Diese Klasse umfasst Begriffe, die die Art des Bezugs von einer Person zu einem Objekt beschreiben, und die im Kontext einer K63 Person Attribution zugewiesen werden, z.B. - dargestellte Person - Hersteller - Erfinder - Jäger
comment: This class includes terms that describe the nature of the relationship from a person to an object, and are assigned in the context of a K63 person attribution, e.g. - person represented - manufacturer - inventor - hunter @en

K66 Object Condition Type
type: Class
subclass of: E55 Type
comment: Diese Klasse umfasst Begriffe, die die Art des Zustands eines Objekts beschreiben, die im Kontext einer K59 Condition Attribution zugewiesen werden, z.B. gut zerbrochen verzaust
comment: This class includes terms that describe the type of state of an object assigned in the context of a K59 condition attribution, e.g. good broken ruffled

K67 Source Content Modification
type: Class
subclass of: E65 Creation
comment: Diese Klasse umfasst Aktivitäten, in denen der K5 Source Content einer K4 Quelle inhaltlich durch eine Person überarbeitet wird, z.B. Revision des Inventars von 1685 durch Christoph Ungelter
comment: This class includes activities in which the K5 source content of a K4 source is revised in terms of content by a person, e.g. Revision of the 1685 inventory by Christoph Ungelter @en

K68 Dimension Type
type: Class
subclass of: E55 Type
comment: Diese Klasse umfasst quantifizierbare Eigenschaften eines Objekts, so z.B. - das Längenmaß - den materiellen Wert - den Durchmesser - das Gewicht
comment: This class includes quantifiable properties of an object, e.g. - the length - the material value - the diameter - the weight @en

K69 Availability Assignment
type: Class
subclass of: E13 Attribute Assignment
comment: Diese Klasse dient dazu, in Instanzen der Klasse K5 Source Content über Instanzen der Klasse K1 Object getätigte Aussagen zu ihrer Verfügbarkeit im Kontext von Instanzen der Klasse K2 Collection zu dokumentieren. K69 Availability Assignment geschieht im Kontext von K17 Object Attribution. Beispiel: - Ereignis der Zuweisung der K70 Art der Verfügbarkeit "ist vorhanden" für K1 Object Präparat eines großen Krokodils ohne Vorderfüße in Quelle Inventar 1694. - Ereignis der Zuweisung der K70 Art der Verfügbarkeit "ist nicht v
comment: This class is used to document statements made in instances of the class K5 Source Content about instances of the class K1 Object regarding their availability in the context of instances of the class K2 Collection. K69 Availability Assignment is done in the context of K17 Object Attribution. Example: - Event of assignment of K70 type of availability "is available" for K1 Object specimen of a large crocodile without front feet in source inventory 1694. - Event of assignment of K70 type of availability "is not available" for K1 Object piece of art made of ivory with sphaera in source inventory 1694. @en

K6 Comment
type: Class
subclass of: E31 Document
comment: Diese Klasse umfasst Texte oder Stichpunkte in einer oder mehreren natürlichen Sprachen. Eine Instanz dieser Klasse dient dem näheren Verständnis eines Sachverhalts und liefert vertiefende oder erläuternde Informationen.
comment: This class comprises texts or keywords in one or more natural languages. An instance of this class is used for a closer understanding of a subject and provides in-depth or explanatory information. @en

K70 Availability Type
type: Class
subclass of: E55 Type
comment: Diese Klasse umfasst Begriffe, die die Art der Verfügbarkeit von Instanzen der Klasse K1 Object im Kontext von Instanzen der Klasse K2 Collection im Kontext einer Verfügbarkeitszuweisung K69 Availability Assignment beschreiben, z. B. - ist vorhanden - ist nicht vorhanden
comment: This class includes terms that describe the type of availability of instances of class K1 Object in the context of instances of class K2 Collection in the context of an availability assignment K69 Availability Assignment, e.g. - is available - is not available @en

K71 Provenance Assignment
type: Class
subclass of: E13 Attribute Assignment
comment: Diese Klasse dient dazu, in Instanzen der Klasse K5 Source Content über Instanzen der Klasse K1 Object getätigte Aussagen zu ihrer Provenienz zu dokumentieren. K71 Provenance Assignment geschieht im Kontext von K17 Object Attribution. Beispiel: - Zuweisung des K8 geografischen Herkunftsorts "Berlin" im Kontext der K71 Provenienzzuweisung für K1 Object Präparat eines großen Krokodils ohne Vorderfüße in Quelle Inventar 1694. - Zuweisung der Vorbesitzerin "Kurfürstin Katharina von Brandenburg" im Kontext der K71 Provenienzzuweisung für K1 Object Kunststück aus Elfenbein mit Sphaera in Quelle Inventar 1694.
comment: This class is used to document statements made in instances of the class K5 Source Content about their provenance via instances of the class K1 Object. K71 Provenance Assignment is done in the context of K17 Object Attribution. Example: - Assignment of K8 geographic place of origin "Berlin" in the context of K71 Provenance Assignment for K1 Object preparation of a large crocodile without front feet in source inventory 1694. - Assignment of the previous owner "Electress Katharina of Brandenburg" in the context of the K71 provenance assignment for K1 Object piece of art made of ivory with sphaera in source inventory 1694. @en

K72 Material Assignment
type: Class
subclass of: E13 Attribute Assignment
comment: Diese Klasse dient dazu, in Instanzen der Klasse K5 Source Content über Instanzen der Klasse K1 Object getätigte Aussagen zu ihrem Werkstoff zu dokumentieren. K72 Material Assignment geschieht im Kontext von K17 Object Attribution. Beispiel: Zuweisung des E57 Werkstoffs Pflanzliches Material im Kontext der K72 Materialzuweisung für K1 Object Fächer aus Palmblättern in Quelle Inventar 1694. Zuweisung des Werkstoffs Elfenbein im Kontext der K72 Materialzuweisung für K1 Object Kunststück aus Elfenbein mit Sphaera in Quelle Inventar 1694.
comment: This class is used to document statements made in instances of the class K5 Source Content about their material via instances of the class K1 Object. K72 Material Assignment happens in the context of K17 Object Attribution. Example: Assignment of E57 Material Vegetable material in the context of K72 Material Assignment for K1 Object Fan made of palm leaves in Source Inventory 1694. Assignment of the material Ivory in the context of K72 Material Attribution for K1 Object Piece of art made of ivory with sphaera in Source Inventory 1694. @en

K73 Analogy Assignment
type: Class
subclass of: E13 Attribute Assignment
comment: Diese Klasse dient dazu, in Instanzen der Klasse K5 Source Content über Instanzen der Klasse K1 Object getätigte Aussagen zu Ähnlichkeiten und Analogien (K74 Type of Analogy) zu dokumentieren. K74 Analogy Assignment geschieht im Kontext von K17 Object Attribution. Beispiel: Zuweisung des K75 Analogietyps Phallus im Kontext der K73 Analogiezuweisung für K1 Object Fächer aus Palmblättern in Quelle Anonymus B "Ein Hirsch Geweihe. Ist wie daß Männl. Glied gestaltet [...]". Zuweisung des K75 Analogietyps Stein im Kontext der K73 Analogiezuweisung für K1 Object Ein Stück "indianisch" Brot in Quelle inventar 1685/1688 "Ein stück Indiansch-Broth, welches so hart wie stein".
comment: This class is used to document statements about similarities and analogies (K74 Type of Analogy) made in instances of the class K5 Source Content via instances of the class K1 Object. K74 Analogy Assignment occurs in the context of K17 Object Attribution. Example: Assignment of K75 Type of Analogy Phallus in the context of K73 Analogy Assignment for K1 Object Fan made of palm leaves in source Anonymous B "A deer's antlers. Is shaped like that male limb [...]". Assignment of the K75 analogy type stone in the context of the K73 analogy assignment for K1 Object A piece of "Indian" bread in source inventar 1685/1688 "Ein stück Indiansch-Broth, welches so hart wie stein". @en

K75 Analogy Type
type: Class
subclass of: E55 Type
comment: Diese Klasse umfasst Begriffe, die die Art der Analogie beschreiben, die Instanzen der Klasse K1 Object im Kontext einer K73 Analogiezuweisung zugewiesen werden. Dabei handelt es sich um Begriffe, die physische Gegenstände oder konzepte beschreiben, die laut Instanzen der Klasse K5 Source Content jenen der Klasse K1 Object ähnlich sind. Beispiele: Phallus Stein Affenhand
comment: This class includes terms that describe the type of analogy assigned to instances of the K1 Object class in the context of a K73 analogy assignment. These are terms that describe physical objects or concepts that instances of the K5 Source Content class say are similar to those of the K1 Object class. Examples: Phallus Stone Monkey hand @en

K76 GeoNames Identifier
type: Class
subclass of: E42 Identifier
comment: Diese Klasse umfasst Zeichenketten oder Kodierungen, die Instanzen der Klasse K8 Geographical Place aus der GeoNames Datenbank zugewiesen werden, um sie eindeutig und dauerhaft zu identifizieren.
comment: This class includes strings or encodings assigned to instances of the K8 Geographical Place class from the GeoNames database to uniquely and permanently identify them. @en

K77 Image Right
type: Class
subclass of: E30 Right
comment: Diese Klasse umfasst Rechte, die mit der (Wieder-)Verwendung von Instanzen der Klasse K35 Digitalisat und Repräsentationen von Instanzen der Klasse K1 Object oder K5 Source Content zusammenhängen.
comment: This class comprises rights related to the (re-)use of K35 Digital Image of instances of the class K1 Object oder K5 Source Content. @en

K78 Licence Type
type: Class
subclass of: E55 Type
comment: Diese Klasse umfasst die Arten von Lizenzen, die für die (Wieder-)Verwendung von Instanzen von K35 Digital Image oder für die Metadaten von Datensätzen von Instanzen von K1 Object oder K5 Source Content durch Dritte angegeben sind, z.B. Creative Commons Lizenzen wie CC-BY-SA 3.0.
comment: This class comprises the types of licences specified for the (re-)use of instances of K35 Digital Image or for the metadata of records of instances of K1 Object oder K5 Source Content by third parties, e.g. Creative Commons Licences like CC-BY-SA 3.0. @en

K79 Literature Section Id
type: Class
subclass of: E42 Identifier
comment: Diese Klasse umfasst Bezeichner für Instanzen des Abschnitts K16 Literatur Section. Beispiel: - "S. 8" (in Bartsch, Adam von: Le peintre graveur. Wien, 1808) - eine URL zum Scan von Seite 8 von Bartsch, 1808
comment: This class comprises identifiers for instances of K16 Literature Section. Example: - "P. 8" (in Bartsch, Adam von: Le peintre graveur. Wien, 1808) - a URL that refers to a scan of page 8 of Bartsch, 1808

K7 Object Type
type: Class
subclass of: E55 Type
comment: Dies ist eine generische, domänenunabhängige Klasse für Begriffe, die zur Klassifizierung von Instanzen der Klasse K1 Object verwendet werden, z.B. - Präparat - Gemälde - Druckgraphik - Modell - Automat - Waffe - Musikinstrument
comment: This is a generic, domain-agnostic class for terms that are used to classify instances of class K1 Object, e.g. - painting - mammal - wet specimen - model - weapon - musical instrument @en

K80 Author
type: Class
subclass of: E21 Person
comment: Diese Klasse bezieht sich auf Schöpfer von Instanzen der Klasse K15 Literature.
comment: This class refers to creators of instances of the class K15 Literature. @en

K81 Collection Organisation Attribution
type: Class
subclass of: E13 Attribute Assignment
comment: Diese Klasse dient dazu, in Instanzen der Klasse K5 Source Content über Instanzen der Klasse K2 Collection getätigte Aussagen zu ihrer Verwaltung zu dokumentieren. K81 Collection Organisation Attribution geschieht im Kontext von K18 Collection Attribution. Beispiel: Ereignis der Zuweisung der Person Christoph Ungelter als Verwalter der Kunstkammer. Ereignis der Zuweisung der Zugehörigkeit der Kunstkammer zur Berliner Akademie der Wissenschaften.
comment: This class is used to document statements made in instances of the class K5 Source Content about instances of the class K2 Collection regarding their management. K81 Collection Organization Attribution occurs in the context of K18 Collection Attribution. Example: Event of attribution of the person Christoph Ungelter as administrator of the Kunstkammer. Event of attribution of the Kunstkammer's affiliation to the Berlin Academy of Sciences.

K82 GettyAAT Id
type: Class
subclass of: E42 Identifier
comment: Diese Klasse umfasst Zeichenketten oder Kodierungen, die Instanzen der Klasse E57 Material und K7 Object Type aus dem Getty Art and Architecture Thesaurus (Getty AAT) zugewiesen werden, um sie eindeutig und dauerhaft zu identifizieren.
comment: This class includes strings or encodings assigned to instances of the E57 Material and K7 Object Type class from the Getty Art and Architecture Thesaurus (Getty AAT) to uniquely and permanently identify them.

K83 Iconclass Id
type: Class
subclass of: E42 Identifier
comment: Diese Klasse umfasst Zeichenketten oder Kodierungen, die Instanzen der Klasse K84 Object Motive aus dem Iconclass Thesaurus des Rijksbureaus voor Kunsthistorische Documentatie (RKD) zugewiesen werden, um sie eindeutig und dauerhaft zu identifizieren.
comment: This class includes strings or encodings assigned to instances of the K84 Object Motifs class from the Rijksbureaus voor Kunsthistorische Documentatie (RKD) Iconclass Thesaurus to uniquely and permanently identify them. @en

K84 Object Motive
type: Class
subclass of: E73 Information Object
comment: Diese Klasse umfasst Motive, die auf Instanzen der Klasse K1 Object dargestellt sind und die ihnen in Ereignissen der Klasse K85 Motive Assignment zugewiesen werden. Dabei handelt es sich um Motive aus der profanen, christlichen oder antiken Ikonografie, um Siegel, Stände oder auch historische Ereignisse, z.B. Adam und Eva, Apoll und Daphne, Die Alexanderschlacht usw. @en
comment: This class includes motifs represented on instances of the K1 Object class and assigned to them in events of the K85 Motif Assignment class. These are motifs from profane, Christian or ancient iconography, seals, stands or even historical events, e.g. Adam and Eve, Apollo and Daphne, The Battle of Alexander, etc. @en

K85 Motive Assignment
type: Class
subclass of: E13 Attribute Assignment
comment: Diese Klasse dient dazu, in Instanzen der Klasse K5 Source Content über Instanzen der Klasse K1 Object getätigte Aussagen zu Motiven (K74 Object Motive) zu dokumentieren. K85 Motive Assignment geschieht im Kontext von K17 Object Attribution. Beispiel: Ereignis der Zuweisung des K84 Motivs Adam und Eva für K1 Adam und Eva aus Elfenbein in Quelle Anonymus B.
comment: This class is used to document statements about motives (K74 Object Motive) made in instances of the class K5 Source Content via instances of the class K1 Object. K85 Motive Assignment is done in the context of K17 Object Attribution. Example: Event of Assignment of K84 Motif Adam and Eve for K1 Adam and Eve of Ivory in Source Anonymous B. @en

K86 Selectiontype
type: Class
subclass of: E55 Type
comment: Diese Klasse dient der Kennzeichnung von Instanzen der Klasse K1 Object, ob sie in der projektzugehörigen Publikation erscheinen. N.B.: Diese Klasse ist spezifisch für das Projekt "Das Fenster zur Natur und Kunst" und möglicherweise in anderen Kontexten nicht anwendbar.
comment: This class is used to mark instances of the K1 Object class as to whether they appear in the publication associated with the project. N.B.: This class is specific to the project "The Window on Nature and Art" and may not be applicable in other contexts.

K87 Type of Acquisition
type: Class
subclass of: E55 Type
comment: Diese Klasse klassifiziert alle Arten von Besitzerwerb, um eine Instanz der Klasse K1 Objekt in eine Sammlung aufzunehmen. Erwerbsarten werden im Kontext von K71 Provenienzzuweisung zugewiesen. Beispiel: Schenkung Ankauf Stiftung
comment: This class classifies all types of acquisition of ownership to include an instance of class K1 Object in a collection. Types of acquisition are assigned in the context of K71 Provenance Assignment. Example: donation purchase foundation

K89 File
type: Class
subclass of: E73 Information Object
comment: Diese Klasse umfasst digitale Dateien, die Instanzen von E1 CRM Entity dokumentieren oder darstellen, z.B. - eine pdf-, eine Word-, eine XML-Datei, .....
comment: This class comprises digital files that document or represent instances of E1 CRM Entity, e.g. - a pdf-, a word-, an xml-file, …

K8 Geographical Place
type: Class
subclass of: E53 Place
comment: Diese Klasse umfasst die Strukturierung von geografischen Elementen, insbesondere auf der bewohnbaren Erdoberfläche. Dazu gehören vom Menschen geschaffene und natürliche geografische Merkmale wie Wohnhäuser, Landkreise, Wasserstraßen, Berge (Gebirge), etc. Geographische Orte können 3-dimensional sein und sich in den Raum oder auf erdigem Boden erstrecken. (z.B. Höhlen). Typischerweise können sie über Ortsverzeichnisse, z.B. GeoNamen, referenziert werden. Beispiele: - Paris (nur die Geographie, nicht die physische Einheit oder das Verwaltungsorgan! Sie kann jedoch als geographische Einheit "Wohnung" oder "Stadt" kategorisiert werden.) - Die Alpen - Tethys
comment: This class comprises structuring geographical elements, esp. on earth's habitable surface. This includes man made and natural geographic features, like dwellings, counties, water ways, mountain (ranges), etc. Geographical places may be 3-dimensional and extend into space or earthen ground. (e.g. caves). Typically they can be referred to by gazetteers, e.g. GeoNames. Examples: - Paris (just the geography, not the physical entity or administrative body! It may, however, be categorized as geographical unit "dwelling" or "city") - The Alps - Tethys @en

K90 Legal Body Assignment
type: Class
subclass of: E13 Attribute Assignment
comment: : This class describes the assignment of instances of the class K40 in the context of instances of the class E7 Activity to express a basic relationship between an event and an entity, e.g. Assignment of the Ausstellungs-, Messe- und Fremdenverkehrs-Amt der Stadt Berlin to the event Summer Show "Old Berlin. Foundations of the cosmopolitan city" @en
comment: Diese Klasse beschreibt die Zuweisung von Instanzen der Klasse K40 im Kontext von Instanzen der Klasse E7 Activity, um einen grundlegenden Zusammenhang zwischen einem Ereignis und einer Körperschaft auszudrücken, z.B. Zuweisung des Ausstellungs-, Messe- und Fremdenverkehrs-Amt der Stadt Berlin zum Ereignis Sommerschau "Altes Berlin. Fundamente der Weltstadt"

K91 Corresponcence Assignment
type: Class
subclass of: E13 Attribute Assignment
comment: Diese Klasse beschreibt Ereignisse, in denen Instanzen der Klasse E1 eine korrespondierende Instanz der Klasse E1 zugewiesen wird, z.B. der Raum 990 im Berliner Schloss (E9 Location) entspricht dem Raum "Zweite Kammer" (E9 Location" aus Tschirnhaus 1727.
comment: This class describes events in which instances of class E1 are assigned a corresponding instance of class E1, e.g. the room 990 in the Berlin Palace (E9 Location) corresponds to the room "Zweite Kammer" (E9 Location) from Tschirnhaus 1727.

K92 Deacession Assignment
type: Class
subclass of: E13 Attribute Assignment
comment: Diese Klasse umfasst Ereignisse, die die Deakzession von Instanzen der Klasse E22 Man made Object aus Instanzen der Klasse K2 Collection beschreiben, z.B. die Abgabe des Narwalzahns aus der Berliner Kunstkammer an die Franckeschen Stiftungen Halle
comment: This class includes events describing the deacession of instances of the class E22 Man made Object from instances of the class K2 Collection, e.g. the transfer of the narwhal's tooth from the Berlin Kunstkammer to the Francke Foundations Halle @en

K93 Object Type Classification
type: Class
subclass of: E55 Type
comment: Diese Klasse wurde vom Projekt entwickelt, um den Instanzen der Klasse K7 Object Type übergeordnete Typen zuzuweisen, die die grundlegenden Kategorien einer Kunstkammer umfassen und erweitern: Naturalia Artificialia Scientifica Memorabilia Mirabilia und Curiosa N.B.: Diese Klasse ist u. U. nicht auf andere Projekte übertragbar.
comment: This class was developed by the project to assign higher-level types to instances of the K7 Object Type class, encompassing and extending the basic categories of a Kunstkammer: Naturalia Artificialia Scientifica Memorabilia Mirabilia and Curiosa N.B.: This class may not be transferable to other projects. @en

K94 Material Classification
type: Class
subclass of: E55 Type
comment: Diese Klasse wurde vom Projekt entwickelt, um den Instanzen der Klasse E57 Material übergeordnete Typen zuzuweisen, um die Bestände in der Forschungsumgebung leichter durchsuchbar zu machen: Metall Glas Pflanzliches Material N.B.: Diese Klasse ist u. U. nicht auf andere Projekte übertragbar.
comment: This class was developed by the project to assign higher-level types to instances of the E57 Material class to make holdings more searchable in the research environment: Metal Glass Plant material N.B.: This class may not be transferable to other projects. @en

K9 Location
type: Class
subclass of: E53 Place
comment: A location is a place that is used to locate things on a sub-geographical level. Other than geographical places they may not have a place name and are not found in gazetteers like GeoNames, but are described/circumscribed, mostly by "speaking titles". A location may be specified by spatial coordinates, though. For geographical reference, a location can be linked to the/a geographical place that it is in. Example: - An specific individual plant was found "under the first oak tree to the left of the main gate". - An object's location is on shelf "XII-3". - An object was found "in the remnants of building X". (where building X could be the surrounding geographical place. N.B.: K9 Location entspricht SP2 Phenomenal Place in CRMgeo.
comment: Ein Standort ist ein Ort, der dazu dient, Dinge auf einer subgeographischen Ebene zu lokalisieren. Anders als geografische Orte haben sie möglicherweise keinen Ortsnamen und sind nicht in Ortsverzeichnissen wie GeoNames zu finden, sondern werden beschrieben/umgeschrieben, meist durch "sprechende Titel". Ein Standort kann jedoch durch räumliche Koordinaten angegeben werden. Als geographische Referenz kann ein Standort mit dem/einem geografischen Ort, an dem er sich befindet, verknüpft werden. Beispiel: - Eine bestimmte Einzelpflanze wurde "unter der ersten Eiche links vom Haupttor" gefunden. - Die Position eines Objekts befindet sich im Regal "XII-3". - Ein Objekt wurde "in den Überresten des Gebäudes X" gefunden. (wobei Gebäude X der umgebende geografische Ort sein könnte. N.B.: K9 Location corresponds to SP2 Phenomenal Place in CRMgeo. @en